Target
ATP-dependent translocase ABCB1
Ligand
BDBM83450
Substrate
Meas. Tech.
ChEMBL_836269 (CHEMBL2076282)
IC50
112000±n/a nM
Citation
 Wandel, CKim, RWood, MWood, A Interaction of morphine, fentanyl, sufentanil, alfentanil, and loperamide with the efflux drug transporter P-glycoprotein. Anesthesiology 96:913-20 (2002)  
Target
Name:
ATP-dependent translocase ABCB1
Synonyms:
ABCB1 MDR1_HUMAN Multidrug resistance protein 1 P-glycoprotein (P-gp) PGY1
Type:
Protein
Mol. Mass.:
141503.50
Organism:
Homo sapiens (Human)
Description:
P08183
Residue:
1280
  
Inhibitor
Name:
BDBM83450
Synonyms:
ALFENTANIL MLS002320667 N-[1-[2-(4-ethyl-5-oxidanylidene-1,2,3,4-tetrazol-1-yl)ethyl]-4-(methoxymethyl)piperidin-4-yl]-N-phenyl-propanamide;hydrochloride N-[1-[2-(4-ethyl-5-oxotetrazol-1-yl)ethyl]-4-(methoxymethyl)piperidin-4-yl]-N-phenylpropanamide;hydrochloride cid_64761
Type:
Small organic molecule
Emp. Form.:
C21H32N6O3
Mol. Mass.:
416.5172
SMILES:
CCC(=O)N(c1ccccc1)C1(COC)CCN(CCn2nnn(CC)c2=O)CC1
: