Target
Solute carrier family 22 member 2
Ligand
BDBM50170653
Substrate
Meas. Tech.
ChEMBL_836775 (CHEMBL2075300)
Ki
605±n/a nM
Citation
 Gründemann, DKöster, SKiefer, NBreidert, TEngelhardt, MSpitzenberger, FObermüller, NSchömig, E Transport of monoamine transmitters by the organic cation transporter type 2, OCT2. J Biol Chem 273:30915-20 (1998)  
Target
Name:
Solute carrier family 22 member 2
Synonyms:
Adrenaline alpha2 Organic cation transporter 2 Slc22a2 rOCT2
Type:
Enzyme Catalytic Domain
Mol. Mass.:
62348.38
Organism:
RAT
Description:
Adrenaline alpha2 0 RAT::Q9R0W2
Residue:
555
  
Inhibitor
Name:
BDBM50170653
Synonyms:
(11beta)-11,21-dihydroxypregn-4-ene-3,20-dione 11beta,21-dihydroxyprogesterone CHEMBL110739 | corticosterone
Type:
Small organic molecule
Emp. Form.:
C21H30O4
Mol. Mass.:
346.4605
SMILES:
C[C@]12C[C@H](O)[C@H]3[C@@H](CCC4=CC(=O)CC[C@]34C)[C@@H]1CC[C@@H]2C(=O)CO
: