Target
Solute carrier family 22 member 3
Ligand
BDBM50014846
Substrate
Meas. Tech.
ChEMBL_837470 (CHEMBL2075864)
Ki
120±n/a nM
Citation
 Gründemann, DSchechinger, BRappold, GASchömig, E Molecular identification of the corticosterone-sensitive extraneuronal catecholamine transporter. Nat Neurosci 1:349-51 (1999)  
Target
Name:
Solute carrier family 22 member 3
Synonyms:
EMT Extraneuronal monoamine transporter Organic cation transporter 3 SLC22A3
Type:
PROTEIN
Mol. Mass.:
61292.57
Organism:
Homo sapiens (Human)
Description:
ChEMBL_934315
Residue:
556
  
Inhibitor
Name:
BDBM50014846
Synonyms:
(S)-N-(5,6,7,9-tetrahydro-1,2,3,10-tetramethoxy-9-oxobenzo[a]heptalen-7-yl)acetamide 7alphaH-colchicine COLCHICINE colchicina | colchicinum
Type:
Small organic molecule
Emp. Form.:
C22H25NO6
Mol. Mass.:
399.437
SMILES:
COc1cc2CC[C@H](NC(C)=O)c3cc(=O)c(OC)ccc3-c2c(OC)c1OC
: