Target
Solute carrier family 22 member 8
Ligand
BDBM50206509
Substrate
Meas. Tech.
ChEMBL_836429 (CHEMBL2076869)
Ki
20000±n/a nM
Citation
 Sugiyama, DKusuhara, HShitara, YAbe, TMeier, PJSekine, TEndou, HSuzuki, HSugiyama, Y Characterization of the efflux transport of 17beta-estradiol-D-17beta-glucuronide from the brain across the blood-brain barrier. J Pharmacol Exp Ther 298:316-22 (2001) Target
Name:
Solute carrier family 22 member 8
Synonyms:
Oat3 S22A8_RAT rOat3
Type:
PROTEIN
Mol. Mass.:
59199.83
Organism:
Rattus norvegicus
Description:
ChEMBL_1482580
Residue:
536
  
Inhibitor
Name:
BDBM50206509
Synonyms:
4-Dipropylsulfamoyl-benzoic acid 4-Dipropylsulfamoyl-benzoic acid(probenecid) CHEMBL897 Probalan
Type:
Small organic molecule
Emp. Form.:
C13H19NO4S
Mol. Mass.:
285.359
SMILES:
CCCN(CCC)S(=O)(=O)c1ccc(cc1)C(O)=O
: