Target
ATP-dependent translocase ABCB1
Ligand
BDBM34168
Substrate
Meas. Tech.
ChEMBL_836603 (CHEMBL2077344)
IC50
26000±n/a nM
Citation
 Wang, ECasciano, CNClement, RPJohnson, WW HMG-CoA reductase inhibitors (statins) characterized as direct inhibitors of P-glycoprotein. Pharm Res 18:800-6 (2001)  
Target
Name:
ATP-dependent translocase ABCB1
Synonyms:
ABCB1 MDR1_HUMAN Multidrug resistance protein 1 P-glycoprotein (P-gp) PGY1
Type:
Protein
Mol. Mass.:
141503.50
Organism:
Homo sapiens (Human)
Description:
P08183
Residue:
1280
  
Inhibitor
Name:
BDBM34168
Synonyms:
LOVASTATIN SMR000058779 US9353061, Lovastatina | cid_53232
Type:
Small organic molecule
Emp. Form.:
C24H36O5
Mol. Mass.:
404.5396
SMILES:
CC[C@H](C)C(=O)O[C@H]1C[C@@H](C)C=C2C=C[C@H](C)[C@H](CC[C@@H]3C[C@@H](O)CC(=O)O3)[C@@H]12
: