Target
Solute carrier family 22 member 8
Ligand
BDBM50390999
Substrate
Meas. Tech.
ChEMBL_838512 (CHEMBL2078140)
Ki
1890±n/a nM
Citation
 Takeda, MBabu, ENarikawa, SEndou, H Interaction of human organic anion transporters with various cephalosporin antibiotics. Eur J Pharmacol 438:137-42 (2002)  
Target
Name:
Solute carrier family 22 member 8
Synonyms:
OAT3 S22A8_HUMAN hOAT3
Type:
PROTEIN
Mol. Mass.:
59870.13
Organism:
Homo sapiens (Human)
Description:
ChEMBL_1486920
Residue:
542
  
Inhibitor
Name:
BDBM50390999
Synonyms:
CEFOPERAZONE
Type:
Small organic molecule
Emp. Form.:
C25H27N9O8S2
Mol. Mass.:
645.667
SMILES:
CCN1CCN(C(=O)N[C@@H](C(=O)N[C@H]2[C@H]3SCC(CSc4nnnn4C)=C(N3C2=O)C(O)=O)c2ccc(O)cc2)C(=O)C1=O
: