Target
Solute carrier family 22 member 8
Ligand
BDBM85245
Substrate
Meas. Tech.
ChEMBL_838511 (CHEMBL2078139)
Ki
1200000±n/a nM
Citation
 Takeda, MKhamdang, SNarikawa, SKimura, HHosoyamada, MCha, SHSekine, TEndou, H Characterization of methotrexate transport and its drug interactions with human organic anion transporters. J Pharmacol Exp Ther 302:666-71 (2002)  
Target
Name:
Solute carrier family 22 member 8
Synonyms:
OAT3 S22A8_HUMAN hOAT3
Type:
PROTEIN
Mol. Mass.:
59870.13
Organism:
Homo sapiens (Human)
Description:
ChEMBL_1486920
Residue:
542
  
Inhibitor
Name:
BDBM85245
Synonyms:
CAS_36322-90-4 Piroxicam
Type:
Small organic molecule
Emp. Form.:
C15H13N3O4S
Mol. Mass.:
331.346
SMILES:
CN1C(C(=O)Nc2ccccn2)=C(O)c2ccccc2S1(=O)=O
: