Target
Solute carrier organic anion transporter family member 1A1
Ligand
BDBM50410506
Substrate
Meas. Tech.
ChEMBL_838286 (CHEMBL2076234)
Ki
9800±n/a nM
Citation
 Kanai, NLu, RBao, YWolkoff, AWVore, MSchuster, VL Estradiol 17 beta-D-glucuronide is a high-affinity substrate for oatp organic anion transporter. Am J Physiol 270:326-31 (1996)  
Target
Name:
Solute carrier organic anion transporter family member 1A1
Synonyms:
OATP-1 Oatp1a1 SO1A1_RAT Slco1a1 Solute carrier family 21 member 1
Type:
PROTEIN
Mol. Mass.:
74188.94
Organism:
Rattus norvegicus
Description:
ChEMBL_838286
Residue:
670
  
Inhibitor
Name:
BDBM50410506
Synonyms:
ESTRIOL
Type:
Small organic molecule
Emp. Form.:
C18H24O3
Mol. Mass.:
288.3814
SMILES:
C[C@]12CC[C@H]3[C@@H](CCc4cc(O)ccc34)[C@@H]1C[C@@H](O)[C@@H]2O
: