Target
Solute carrier organic anion transporter family member 2A1
Ligand
BDBM25902
Substrate
Meas. Tech.
ChEMBL_836139 (CHEMBL2077575)
Ki
47000±n/a nM
Citation
 Kanai, NLu, RSatriano, JABao, YWolkoff, AWSchuster, VL Identification and characterization of a prostaglandin transporter. Science 268:866-869 (1995)  
Target
Name:
Solute carrier organic anion transporter family member 2A1
Synonyms:
Matr1 Prostaglandin transporter (PGT) Slc21a2 Solute carrier family 21 member 2
Type:
Protein
Mol. Mass.:
70404.97
Organism:
Rattus norvegicus (Rat)
Description:
Q00910
Residue:
644
  
Inhibitor
Name:
BDBM25902
Synonyms:
4-chloro-2-[(furan-2-ylmethyl)amino]-5-sulfamoylbenzoic acid Frusemide Furosemide Furosemide, 4 US10172837, Furosemide
Type:
Small organic molecule
Emp. Form.:
C12H11ClN2O5S
Mol. Mass.:
330.744
SMILES:
NS(=O)(=O)c1cc(C(O)=O)c(NCc2ccco2)cc1Cl
: