Target
Solute carrier family 22 member 1
Ligand
BDBM50420178
Substrate
Meas. Tech.
ChEMBL_838298 (CHEMBL2076246)
IC50
4470000±n/a nM
Citation
 Arndt, PVolk, CGorboulev, VBudiman, TPopp, CUlzheimer-Teuber, IAkhoundova, AKoppatz, SBamberg, ENagel, GKoepsell, H Interaction of cations, anions, and weak base quinine with rat renal cation transporter rOCT2 compared with rOCT1. Am J Physiol Renal Physiol 281:454-68 (2001)  
Target
Name:
Solute carrier family 22 member 1
Synonyms:
Adrenaline alpha1 Organic cation transporter 1 Slc22a1 adrenergic Alpha1 | rOCT1
Type:
Enzyme Catalytic Domain
Mol. Mass.:
61538.40
Organism:
RAT
Description:
Adrenaline alpha1 0 RAT::Q63089
Residue:
556
  
Inhibitor
Name:
BDBM50420178
Synonyms:
GUANIDINE
Type:
Small organic molecule
Emp. Form.:
CH5N3
Mol. Mass.:
59.0705
SMILES:
NC(N)=N
: