Target
Solute carrier family 22 member 2
Ligand
BDBM50079455
Substrate
Meas. Tech.
ChEMBL_838297 (CHEMBL2076245)
IC50
630000±n/a nM
Citation
 Arndt, PVolk, CGorboulev, VBudiman, TPopp, CUlzheimer-Teuber, IAkhoundova, AKoppatz, SBamberg, ENagel, GKoepsell, H Interaction of cations, anions, and weak base quinine with rat renal cation transporter rOCT2 compared with rOCT1. Am J Physiol Renal Physiol 281:454-68 (2001)  
Target
Name:
Solute carrier family 22 member 2
Synonyms:
Adrenaline alpha2 Organic cation transporter 2 Slc22a2 rOCT2
Type:
Enzyme Catalytic Domain
Mol. Mass.:
62348.38
Organism:
RAT
Description:
Adrenaline alpha2 0 RAT::Q9R0W2
Residue:
555
  
Inhibitor
Name:
BDBM50079455
Synonyms:
CHEMBL46486 | tetramethylammonium
Type:
Small organic molecule
Emp. Form.:
C4H12N
Mol. Mass.:
74.1442
SMILES:
C[N+](C)(C)C
: