Target
Solute carrier family 15 member 1
Ligand
BDBM50139896
Substrate
Meas. Tech.
ChEMBL_838254 (CHEMBL2076202)
Ki
14400000±n/a nM
Citation
 Luckner, PBrandsch, M Interaction of 31 beta-lactam antibiotics with the H+/peptide symporter PEPT2: analysis of affinity constants and comparison with PEPT1. Eur J Pharm Biopharm 59:17-24 (2004)  
Target
Name:
Solute carrier family 15 member 1
Synonyms:
Intestinal H(+)/peptide cotransporter Oligopeptide transporter, small intestine isoform Peptide transporter 1 SLC15A1
Type:
PROTEIN
Mol. Mass.:
78818.07
Organism:
Homo sapiens (Human)
Description:
ChEMBL_1488839
Residue:
708
  
Inhibitor
Name:
BDBM50139896
Synonyms:
(6R,7R)-7-((R)-2-Amino-2-phenyl-acetylamino)-3-methyl-8-oxo-5-thia-1-aza-bicyclo[4.2.0]oct-2-ene-2-carboxylic acid CEPHALEXIN KEFLET KEFTAB
Type:
Small organic molecule
Emp. Form.:
C16H17N3O4S
Mol. Mass.:
347.389
SMILES:
CC1=C(N2[C@H](SC1)[C@H](NC(=O)[C@H](N)c1ccccc1)C2=O)C(O)=O
: