Target
Solute carrier family 15 member 2
Ligand
BDBM50350473
Substrate
Meas. Tech.
ChEMBL_838253 (CHEMBL2076201)
Ki
8500±n/a nM
Citation
 Luckner, PBrandsch, M Interaction of 31 beta-lactam antibiotics with the H+/peptide symporter PEPT2: analysis of affinity constants and comparison with PEPT1. Eur J Pharm Biopharm 59:17-24 (2004)  
Target
Name:
Solute carrier family 15 member 2
Synonyms:
Oligopeptide transporter, kidney isoform S15A2_RAT | Slc15a2
Type:
PROTEIN
Mol. Mass.:
81331.63
Organism:
Rattus norvegicus
Description:
ChEMBL_838253
Residue:
729
  
Inhibitor
Name:
BDBM50350473
Synonyms:
Aliporina | CEFALORIDINE
Type:
Small organic molecule
Emp. Form.:
C19H17N3O4S2
Mol. Mass.:
415.486
SMILES:
[O-]C(=O)C1=C(C[n+]2ccccc2)CS[C@@H]2[C@@H](NC(=O)Cc3cccs3)C(=O)N12
: