Target
Solute carrier family 15 member 2
Ligand
BDBM50350468
Substrate
Meas. Tech.
ChEMBL_838253 (CHEMBL2076201)
Ki
2800000±n/a nM
Citation
 Luckner, PBrandsch, M Interaction of 31 beta-lactam antibiotics with the H+/peptide symporter PEPT2: analysis of affinity constants and comparison with PEPT1. Eur J Pharm Biopharm 59:17-24 (2004)  
Target
Name:
Solute carrier family 15 member 2
Synonyms:
Oligopeptide transporter, kidney isoform S15A2_RAT | Slc15a2
Type:
PROTEIN
Mol. Mass.:
81331.63
Organism:
Rattus norvegicus
Description:
ChEMBL_838253
Residue:
729
  
Inhibitor
Name:
BDBM50350468
Synonyms:
CEFAMANDOLE
Type:
Small organic molecule
Emp. Form.:
C18H18N6O5S2
Mol. Mass.:
462.503
SMILES:
Cn1nnnc1SCC1=C(N2[C@H](SC1)[C@H](NC(=O)[C@H](O)c1ccccc1)C2=O)C(O)=O
: