Target
Alpha-2C adrenergic receptor
Ligand
BDBM50419878
Substrate
Meas. Tech.
ChEMBL_840305 (CHEMBL2091262)
EC50
2±n/a nM
Citation
 Del Bello, FDiamanti, EGiannella, MMammoli, VMarchioro, CMattioli, LTitomanlio, FPiergentili, AQuaglia, WBenedetti, GVarrone, MPigini, M Low Doses of Allyphenyline and Cyclomethyline, Effective against Morphine Dependence, Elicit an Antidepressant-like Effect. ACS Med Chem Lett 3:535-539 (2012)  
Target
Name:
Alpha-2C adrenergic receptor
Synonyms:
ADA2C_HUMAN ADRA2L2 Adrenergic alpha2C Adrenergic receptor alpha Alpha-2 adrenergic receptor subtype C4 Alpha-2C adrenoreceptor | adrenergic, alpha-2C-, receptor [Homo sapiens]
Type:
Enzyme
Mol. Mass.:
49552.32
Organism:
Homo sapiens (Human)
Description:
P18825
Residue:
462
  
Inhibitor
Name:
BDBM50419878
Synonyms:
CHEMBL1956195
Type:
Small organic molecule
Emp. Form.:
C15H20N2O
Mol. Mass.:
244.3321
SMILES:
CC(Oc1ccccc1CC1CC1)C1=NCCN1
: