Target
Beta-lactamase
Ligand
BDBM50421217
Substrate
Meas. Tech.
ChEMBL_839906 (CHEMBL2090107)
IC50
>200000±n/a nM
Citation
 Chen, PHorton, LBMikulski, RLDeng, LSundriyal, SPalzkill, TSong, Y 2-Substituted 4,5-dihydrothiazole-4-carboxylic acids are novel inhibitors of metallo-ß-lactamases. Bioorg Med Chem Lett 22:6229-32 (2012)  
Target
Name:
Beta-lactamase
Synonyms:
BAS3245 Beta-lactamase II bla2
Type:
Enzyme
Mol. Mass.:
28177.23
Organism:
Bacillus anthracis
Description:
Q93T40
Residue:
256
  
Inhibitor
Name:
BDBM50421217
Synonyms:
CHEMBL2086406
Type:
Small organic molecule
Emp. Form.:
C13H14N2O3S
Mol. Mass.:
278.327
SMILES:
OC(=O)[C@@H]1CSC(CNC(=O)Cc2ccccc2)=N1
: