Target
Beta-lactamase
Ligand
BDBM50421214
Substrate
Meas. Tech.
ChEMBL_839906 (CHEMBL2090107)
Ki
5100±n/a nM
Citation
 Chen, PHorton, LBMikulski, RLDeng, LSundriyal, SPalzkill, TSong, Y 2-Substituted 4,5-dihydrothiazole-4-carboxylic acids are novel inhibitors of metallo-ß-lactamases. Bioorg Med Chem Lett 22:6229-32 (2012)  
Target
Name:
Beta-lactamase
Synonyms:
BAS3245 Beta-lactamase II bla2
Type:
Enzyme
Mol. Mass.:
28177.23
Organism:
Bacillus anthracis
Description:
Q93T40
Residue:
256
  
Inhibitor
Name:
BDBM50421214
Synonyms:
CHEMBL2087633
Type:
Small organic molecule
Emp. Form.:
C10H10N2O2S
Mol. Mass.:
222.264
SMILES:
Nc1cccc(c1)C1=N[C@@H](CS1)C(O)=O
: