Target
Activated CDC42 kinase 1
Ligand
BDBM50421270
Substrate
Meas. Tech.
ChEMBL_840100 (CHEMBL2090704)
IC50
160±n/a nM
Citation
 Jiao, XKopecky, DJLiu, JLiu, JJaen, JCCardozo, MGSharma, RWalker, NWesche, HLi, SFarrelly, EXiao, SHWang, ZKayser, F Synthesis and optimization of substituted furo[2,3-d]-pyrimidin-4-amines and 7H-pyrrolo[2,3-d]pyrimidin-4-amines as ACK1 inhibitors. Bioorg Med Chem Lett 22:6212-7 (2012)  
Target
Name:
Activated CDC42 kinase 1
Synonyms:
ACK-1 Ack1 Tnk2
Type:
PROTEIN
Mol. Mass.:
116986.19
Organism:
Mus musculus
Description:
ChEMBL_840100
Residue:
1055
  
Inhibitor
Name:
BDBM50421270
Synonyms:
CHEMBL2087671
Type:
Small organic molecule
Emp. Form.:
C30H35N5O3
Mol. Mass.:
513.6306
SMILES:
COc1cccc(c1)-c1c([nH]c2ncnc(NC[C@@H]3CCCO3)c12)-c1ccc(OCCN2CCCC2)cc1
: