Target
Alpha-1B adrenergic receptor
Ligand
BDBM50001922
Substrate
Meas. Tech.
ChEMBL_30099 (CHEMBL858092)
EC50
<5012±n/a nM
Citation
 Bishop, MJBerman, JBigham, ECGarrison, DTGobel, MJHodson, SJIrving, PELiacos, JAMinick, DJNavas, FSaussy, DLSpeake, JD 2-(Anilinomethyl)imidazolines as alpha(1)-adrenoceptor agonists: the identification of alpha(1A) subtype selective 2'-carboxylic acid esters and amides. Bioorg Med Chem Lett 11:2871-4 (2001)  
Target
Name:
Alpha-1B adrenergic receptor
Synonyms:
ADA1B_HUMAN Adrenergic alpha1B Adrenergic receptor alpha Alpha 1B-adrenoreceptor | Alpha-1B adrenergic receptor
Type:
Enzyme
Mol. Mass.:
56862.13
Organism:
Homo sapiens (Human)
Description:
P35368
Residue:
520
  
Inhibitor
Name:
BDBM50001922
Synonyms:
2-Naphthalen-1-ylmethyl-4,5-dihydro-1H-imidazole; hydrochloride CHEMBL1706 Nafazair Naphazoline Nitrate Opcon cid_11079
Type:
Small organic molecule
Emp. Form.:
C14H14N2
Mol. Mass.:
210.2744
SMILES:
C(C1=NCCN1)c1cccc2ccccc12
: