Target
Sex hormone-binding globulin
Ligand
BDBM50240916
Substrate
Meas. Tech.
ChEMBL_466706 (CHEMBL922711)
Kd
309±n/a nM
Citation
 Cherkasov, ABan, FSantos-Filho, OThorsteinson, NFallahi, MHammond, GL An updated steroid benchmark set and its application in the discovery of novel nanomolar ligands of sex hormone-binding globulin. J Med Chem 51:2047-56 (2008)  
Target
Name:
Sex hormone-binding globulin
Synonyms:
SHBG Testis-specific androgen-binding protein
Type:
PROTEIN
Mol. Mass.:
43780.19
Organism:
Homo sapiens (Human)
Description:
ChEMBL_466706
Residue:
402
  
Inhibitor
Name:
BDBM50240916
Synonyms:
(-)-3,4-divanillyltetrahydrofuran 4-[4-(4-hydroxy-3-methoxybenzyl)-(3R,4R)-tetrahydro-3-furanylmethyl]-2-methoxyphenol | CHEMBL367448
Type:
Small organic molecule
Emp. Form.:
C20H24O5
Mol. Mass.:
344.4016
SMILES:
COc1cc(C[C@H]2COC[C@@H]2Cc2ccc(O)c(OC)c2)ccc1O
: