Target
Sex hormone-binding globulin
Ligand
BDBM50423511
Substrate
Meas. Tech.
ChEMBL_466706 (CHEMBL922711)
Kd
100±n/a nM
Citation
 Cherkasov, ABan, FSantos-Filho, OThorsteinson, NFallahi, MHammond, GL An updated steroid benchmark set and its application in the discovery of novel nanomolar ligands of sex hormone-binding globulin. J Med Chem 51:2047-56 (2008)  
Target
Name:
Sex hormone-binding globulin
Synonyms:
SHBG Testis-specific androgen-binding protein
Type:
PROTEIN
Mol. Mass.:
43780.19
Organism:
Homo sapiens (Human)
Description:
ChEMBL_466706
Residue:
402
  
Inhibitor
Name:
BDBM50423511
Synonyms:
Delalutin | HYDROXYPROGESTERONE
Type:
Small organic molecule
Emp. Form.:
C21H30O3
Mol. Mass.:
330.4611
SMILES:
CC(=O)[C@@]1(O)CC[C@H]2[C@@H]3CCC4=CC(=O)CC[C@]4(C)[C@H]3CC[C@]12C
: