Target
Beta-3 adrenergic receptor
Ligand
BDBM50423828
Substrate
Meas. Tech.
ChEMBL_770403 (CHEMBL1833712)
Kd
63±n/a nM
Citation
 Baker, JGAdams, LASalchow, KMistry, SNMiddleton, RJHill, SJKellam, B Synthesis and characterization of high-affinity 4,4-difluoro-4-bora-3a,4a-diaza-s-indacene-labeled fluorescent ligands for humanß-adrenoceptors. J Med Chem 54:6874-87 (2011)  
Target
Name:
Beta-3 adrenergic receptor
Synonyms:
ADRB3 ADRB3_HUMAN Beta-2 adrenergic receptor and beta-3 adrenergic receptor Beta-3 adrenoreceptor | adrenergic Beta3
Type:
G Protein-Coupled Receptor (GPCR)
Mol. Mass.:
43534.88
Organism:
Homo sapiens (Human)
Description:
Residue:
408
  
Inhibitor
Name:
BDBM50423828
Synonyms:
CHEMBL1830488
Type:
Small organic molecule
Emp. Form.:
C44H46BF2N5O5S
Mol. Mass.:
805.739
SMILES:
OC(CNCCNC(=O)CCCCCNC(=O)COc1ccc(\C=C\c2ccc3C=C4C=CC(c5cccs5)=[N+]4[B-](F)(F)n23)cc1)COc1cccc2ccccc12
: