Target
Glucose-dependent insulinotropic receptor
Ligand
BDBM50364541
Substrate
Meas. Tech.
ChEMBL_933672 (CHEMBL2320533)
Ki
53±n/a nM
Citation
 Darout, ERobinson, RPMcClure, KFCorbett, MLi, BShavnya, AAndrews, MPJones, CSLi, QMinich, MLMascitti, VGuimarães, CRMunchhof, MJBahnck, KBCai, CPrice, DALiras, SBonin, PDCornelius, PWang, RBagdasarian, VSobota, CPHornby, SMasterson, VMJoseph, RMKalgutkar, ASChen, Y Design and synthesis of diazatricyclodecane agonists of the G-protein-coupled receptor 119. J Med Chem 56:301-19 (2013)  
Target
Name:
Glucose-dependent insulinotropic receptor
Synonyms:
G-protein coupled receptor 119 (GPR119) GPR119 | Glucose-dependent insulinotropic receptor
Type:
Protein
Mol. Mass.:
36901.49
Organism:
Homo sapiens (Human)
Description:
Q8TDV5
Residue:
335
  
Inhibitor
Name:
BDBM50364541
Synonyms:
CHEMBL1951011
Type:
Small organic molecule
Emp. Form.:
C21H26FN3O6S
Mol. Mass.:
467.511
SMILES:
CC(C)OC(=O)N1CCC(CC1)Oc1ncnc(Oc2ccc(cc2F)S(C)(=O)=O)c1C
: