Target
Glucose-dependent insulinotropic receptor
Ligand
BDBM50424574
Substrate
Meas. Tech.
ChEMBL_933672 (CHEMBL2320533)
Ki
1148±n/a nM
Citation
 Darout, ERobinson, RPMcClure, KFCorbett, MLi, BShavnya, AAndrews, MPJones, CSLi, QMinich, MLMascitti, VGuimarães, CRMunchhof, MJBahnck, KBCai, CPrice, DALiras, SBonin, PDCornelius, PWang, RBagdasarian, VSobota, CPHornby, SMasterson, VMJoseph, RMKalgutkar, ASChen, Y Design and synthesis of diazatricyclodecane agonists of the G-protein-coupled receptor 119. J Med Chem 56:301-19 (2013)  
Target
Name:
Glucose-dependent insulinotropic receptor
Synonyms:
G-protein coupled receptor 119 (GPR119) GPR119 | Glucose-dependent insulinotropic receptor
Type:
Protein
Mol. Mass.:
36901.49
Organism:
Homo sapiens (Human)
Description:
Q8TDV5
Residue:
335
  
Inhibitor
Name:
BDBM50424574
Synonyms:
CHEMBL2312160
Type:
Small organic molecule
Emp. Form.:
C26H32FN5O4
Mol. Mass.:
497.5618
SMILES:
CC(C)OC(=O)N1C2CC3CC1CC(C2)N3c1ncnc(Oc2ccc(cc2F)C(=O)N(C)C)c1C
: