Target
Multidrug and toxin extrusion protein 1
Ligand
BDBM85330
Substrate
Meas. Tech.
ChEMBL_934320 (CHEMBL2320306)
IC50
160±n/a nM
Citation
 Wittwer, MBZur, AAKhuri, NKido, YKosaka, AZhang, XMorrissey, KMSali, AHuang, YGiacomini, KM Discovery of potent, selective multidrug and toxin extrusion transporter 1 (MATE1, SLC47A1) inhibitors through prescription drug profiling and computational modeling. J Med Chem 56:781-95 (2013)  
Target
Name:
Multidrug and toxin extrusion protein 1
Synonyms:
MATE-1 S47A1_HUMAN Solute carrier family 47 member 1 | hMATE-1
Type:
PROTEIN
Mol. Mass.:
61928.01
Organism:
Homo sapiens (Human)
Description:
ChEMBL_934313
Residue:
570
  
Inhibitor
Name:
BDBM85330
Synonyms:
CAS_68647 ONDANSETRON | Ondansetron hydrochloride
Type:
Small organic molecule
Emp. Form.:
C18H19N3O
Mol. Mass.:
293.363
SMILES:
Cc1nccn1CC1CCc2c(C1=O)c1ccccc1n2C
: