Target
D(2) dopamine receptor
Ligand
BDBM50426498
Substrate
Meas. Tech.
ChEMBL_938242 (CHEMBL2328665)
EC50
1.4±n/a nM
Citation
 Dosa, PIWard, TWalters, MAKim, SW Synthesis of novel analogs of cabergoline: improving cardiovascular safety by removing 5-HT2B receptor agonism. ACS Med Chem Lett 4:254-258 (2013)  
Target
Name:
D(2) dopamine receptor
Synonyms:
D(2) dopamine receptor DOPAMINE D2 Long DRD2 Dopamine D2 receptor Dopamine D2 receptor (D2R) Dopamine2-like | d2
Type:
Cell-surface receptors
Mol. Mass.:
50647.10
Organism:
Homo sapiens (Human)
Description:
P14416
Residue:
443
  
Inhibitor
Name:
BDBM50426498
Synonyms:
1,6-Dimethylcabergoline | CHEMBL2323579
Type:
Small organic molecule
Emp. Form.:
C25H37N5O2
Mol. Mass.:
439.5936
SMILES:
CCNC(=O)N(CCCN(C)C)C(=O)[C@@H]1C[C@H]2[C@@H](Cc3cn(C)c4cccc2c34)N(C)C1
: