Target
Alpha-1B adrenergic receptor
Ligand
BDBM50001786
Substrate
Meas. Tech.
ChEMBL_939352 (CHEMBL2327487)
Ki
0.330000±n/a nM
Citation
 Jørgensen, MJørgensen, PNChristoffersen, CTJensen, KGBalle, TBang-Andersen, B Discovery of novela1-adrenoceptor ligands based on the antipsychotic sertindole suitable for labeling as PET ligands. Bioorg Med Chem 21:196-204 (2012)  
Target
Name:
Alpha-1B adrenergic receptor
Synonyms:
ADA1B_MESAU Adrenergic receptor alpha adrenergic Alpha1B
Type:
Enzyme Catalytic Domain
Mol. Mass.:
56514.13
Organism:
C.H.O.
Description:
adrenergic Alpha1B ADRA1B C.H.O.::P18841
Residue:
515
  
Inhibitor
Name:
BDBM50001786
Synonyms:
1-(2-{4-[5-chloro-1-(4-fluorophenyl)-1H-indol-3-yl]piperidin-1-yl}ethyl)imidazolidin-2-one CHEMBL12713 | Sertindole
Type:
Small organic molecule
Emp. Form.:
C24H26ClFN4O
Mol. Mass.:
440.941
SMILES:
Fc1ccc(cc1)-n1cc(C2CCN(CCN3CCNC3=O)CC2)c2cc(Cl)ccc12
: