Target
SUMO-activating enzyme subunit 1
Ligand
BDBM50427033
Substrate
Meas. Tech.
ChEMBL_939697 (CHEMBL2328922)
IC50
11700±n/a nM
Citation
 da Silva, SRPaiva, SLLukkarila, JLGunning, PT Exploring a new frontier in cancer treatment: targeting the ubiquitin and ubiquitin-like activating enzymes. J Med Chem 56:2165-77 (2013)  
Target
Name:
SUMO-activating enzyme subunit 1
Synonyms:
AOS1 SAE1_HUMAN SUMO-activating enzyme subunit 1 (SAE1) UBLE1A
Type:
Enzyme Catalytic Domain
Mol. Mass.:
38440.84
Organism:
Homo sapiens (Human)
Description:
gi_17390638
Residue:
346
  
Inhibitor
Name:
BDBM50427033
Synonyms:
CHEMBL2322195 | Kerriamycin B
Type:
Small organic molecule
Emp. Form.:
C43H56O17
Mol. Mass.:
844.8945
SMILES:
C[C@@H]1O[C@H](CC[C@@H]1O)O[C@]12C(=O)C[C@](C)(O)C[C@@]1(O)C=CC1=C2C(=O)c2ccc([C@H]3C[C@@H](O)[C@H](O[C@H]4CC[C@H](O[C@H]5C[C@@H](O)[C@H](O)[C@@H](C)O5)[C@H](C)O4)[C@@H](C)O3)c(O)c2C1=O
: