Target
Kinesin-like protein KIF11
Ligand
BDBM50427274
Substrate
Meas. Tech.
ChEMBL_940910 (CHEMBL2330556)
Ki
1.2±n/a nM
Citation
 Good, JAWang, FRath, OKaan, HYTalapatra, SKPodgórski, DMacKay, SPKozielski, F Optimized S-trityl-L-cysteine-based inhibitors of kinesin spindle protein with potent in vivo antitumor activity in lung cancer xenograft models. J Med Chem 56:1878-93 (2013)  
Target
Name:
Kinesin-like protein KIF11
Synonyms:
EG5 KIF11_HUMAN Kinesin Spindle Protein Eg5 TRIP5 | kinesin spindle protein
Type:
PROTEIN
Mol. Mass.:
119138.97
Organism:
Homo sapiens (Human)
Description:
ChEMBL_1457426
Residue:
1056
  
Inhibitor
Name:
BDBM50427274
Synonyms:
CHEMBL2325410
Type:
Small organic molecule
Emp. Form.:
C24H25NO2S
Mol. Mass.:
391.526
SMILES:
Cc1ccc(cc1C)C(SC[C@H](N)C(O)=O)(c1ccccc1)c1ccccc1
: