Target
Cytochrome P450 2C19
Ligand
BDBM50428101
Substrate
Meas. Tech.
ChEMBL_943938 (CHEMBL2339905)
IC50
>30000±n/a nM
Citation
 Piotrowski, DWFutatsugi, KWarmus, JSOrr, STFreeman-Cook, KDLondregan, ATWei, LJennings, SMHerr, MCoffey, SBJiao, WStorer, GHepworth, DWang, JLavergne, SYChin, JEHadcock, JRBrenner, MBWolford, ACJanssen, AMRoush, NSBuxton, JHinchey, TKalgutkar, ASSharma, RFlynn, DA Identification of Tetrahydropyrido[4,3-d]pyrimidine Amides as a New Class of Orally Bioavailable TGR5 Agonists. ACS Med Chem Lett 4:63-8 (2013)  
Target
Name:
Cytochrome P450 2C19
Synonyms:
CP2CJ_HUMAN CYPIIC17 Cytochrome P450 2C19 (CYP2C19) Mephenytoin 4-hydroxylase P450-254C
Type:
Enzyme
Mol. Mass.:
55935.47
Organism:
Homo sapiens (Human)
Description:
P33261
Residue:
490
  
Inhibitor
Name:
BDBM50428101
Synonyms:
CHEMBL2331648
Type:
Small organic molecule
Emp. Form.:
C20H22F3N5O3
Mol. Mass.:
437.4156
SMILES:
CCNc1nc2CCN(Cc2c(n1)C(N)=O)C(=O)CCc1ccc(OC(F)(F)F)cc1
: