Target
Gamma-aminobutyric acid receptor subunit rho-1
Ligand
BDBM50428275
Substrate
Meas. Tech.
ChEMBL_946447 (CHEMBL2339627)
IC50
147920±n/a nM
Citation
 Gavande, NKim, HLDoddareddy, MRJohnston, GAChebib, MHanrahan, JR Design, Synthesis, and Pharmacological Evaluation of Fluorescent and Biotinylated Antagonists of?1 GABAC Receptors. ACS Med Chem Lett 4:402-7 (2013)  
Target
Name:
Gamma-aminobutyric acid receptor subunit rho-1
Synonyms:
GABA receptor rho-1 subunit GABRR1 | GBRR1_HUMAN
Type:
PROTEIN
Mol. Mass.:
55892.34
Organism:
Homo sapiens (Human)
Description:
ChEMBL_1456653
Residue:
479
  
Inhibitor
Name:
BDBM50428275
Synonyms:
CHEMBL2337889
Type:
Small organic molecule
Emp. Form.:
C25H43N4O5PS
Mol. Mass.:
542.671
SMILES:
CCCCP(O)(=O)C1=C[C@H](CC1)NC(=O)CCCCCNC(=O)CCCC[C@@H]1SC[C@@H]2NC(=O)N[C@H]12
: