Target
cGMP-inhibited 3',5'-cyclic phosphodiesterase 3A
Ligand
BDBM50428575
Substrate
Meas. Tech.
ChEMBL_945513 (CHEMBL2343517)
IC50
360±n/a nM
Citation
 Ochiai, KTakita, SKojima, AEiraku, TIwase, KKishi, TOhinata, AYageta, YYasue, TAdams, DRKohno, Y Phosphodiesterase inhibitors. Part 5: hybrid PDE3/4 inhibitors as dual bronchorelaxant/anti-inflammatory agents for inhaled administration. Bioorg Med Chem Lett 23:375-81 (2012)  
Target
Name:
cGMP-inhibited 3',5'-cyclic phosphodiesterase 3A
Synonyms:
3',5'-cyclic phosphodiesterase Cyclic GMP-inhibited phosphodiesterase A PDE3A_HUMAN Phosphodiesterase 3 (PDE3) Phosphodiesterase 3A Phosphodiesterase 3A (PDE3A1) cGMP-inhibited 3',5'-cyclic phosphodiesterase A | cGMP-inhibited 3,5-cyclic phosphodiesterase A
Type:
Enzyme
Mol. Mass.:
124966.46
Organism:
Homo sapiens (Human)
Description:
Q14432
Residue:
1141
  
Inhibitor
Name:
BDBM50428575
Synonyms:
CHEMBL2337960
Type:
Small organic molecule
Emp. Form.:
C28H29F3N6O4
Mol. Mass.:
570.5629
SMILES:
COc1ccc(C2=NN(CCCCOc3ccc(cc3)C3=NNC(=O)CC3)C(=O)CC2C)c2cc(nn12)C(F)(F)F
: