Target
Interstitial collagenase
Ligand
BDBM50175535
Substrate
Meas. Tech.
ChEMBL_948654 (CHEMBL2345604)
IC50
11000±n/a nM
Citation
 Nuti, ESantamaria, SCasalini, FYamamoto, KMarinelli, LLa Pietra, VNovellino, EOrlandini, ENencetti, SMarini, AMSalerno, STaliani, SDa Settimo, FNagase, HRossello, A Arylsulfonamide inhibitors of aggrecanases as potential therapeutic agents for osteoarthritis: synthesis and biological evaluation. Eur J Med Chem 62:379-94 (2013)  
Target
Name:
Interstitial collagenase
Synonyms:
CLG MMP1 Matrix metalloproteinase-1 | Matrix metalloproteinase-1 (MMP-1)
Type:
Enzyme
Mol. Mass.:
54010.26
Organism:
Homo sapiens (Human)
Description:
P03956
Residue:
469
  
Inhibitor
Name:
BDBM50175535
Synonyms:
2-(4-Butoxy-benzenesulfonylamino)-N-hydroxy-acetamide | CHEMBL197842
Type:
Small organic molecule
Emp. Form.:
C12H18N2O5S
Mol. Mass.:
302.347
SMILES:
CCCCOc1ccc(cc1)S(=O)(=O)NCC(=O)NO
: