Target
3-beta-hydroxysteroid-Delta(8),Delta(7)-isomerase
Ligand
BDBM50430556
Substrate
Meas. Tech.
ChEMBL_946767 (CHEMBL2344571)
IC50
7000±n/a nM
Citation
 König, MMüller, CBracher, F Stereoselective synthesis of a new class of potent and selective inhibitors of human¿8,7-sterol isomerase. Bioorg Med Chem 21:1925-43 (2013)  
Target
Name:
3-beta-hydroxysteroid-Delta(8),Delta(7)-isomerase
Synonyms:
3-beta-hydroxysteroid-Delta(8),Delta(7)-isomerase/Delta(24)-sterol reductase Anti-estrogen binding site (AEBS) D8-D7 sterol isomerase EBP Emopamil-binding protein
Type:
PROTEIN
Mol. Mass.:
26358.51
Organism:
Homo sapiens (Human)
Description:
ChEMBL_873432
Residue:
230
  
Inhibitor
Name:
BDBM50430556
Synonyms:
CHEMBL2336934
Type:
Small organic molecule
Emp. Form.:
C27H45NO
Mol. Mass.:
399.6523
SMILES:
CC(C)CCC[C@@H](C)[C@H]1CC[C@@]2(C)[C@@H](O)[C@H](CC[C@]12C)N(C)Cc1ccccc1
: