Target
Androgen receptor
Ligand
BDBM35909
Substrate
Meas. Tech.
ChEMBL_942995 (CHEMBL2343831)
IC50
300±n/a nM
Citation
 Nakamura, MMakishima, MHashimoto, Y Development of silicon-containing bis-phenol derivatives as androgen receptor antagonists: selectivity switching by C/Si exchange. Bioorg Med Chem 21:1643-51 (2013)  
Target
Name:
Androgen receptor
Synonyms:
ANDR_HUMAN Androgen Receptor Androgen receptor/Baculoviral IAP repeat-containing protein 2 Dihydrotestosterone receptor Nuclear receptor subfamily 3 group C member 4
Type:
Receptor
Mol. Mass.:
99185.27
Organism:
Homo sapiens (Human)
Description:
CHO cells were stably transfected with human AR gene.
Residue:
920
  
Inhibitor
Name:
BDBM35909
Synonyms:
2-Hydroxy-2-methyl-N-(4-nitro-3-trifluoromethyl-phenyl)-propionamide 2-Hydroxy-2-methyl-N-(4-nitro-3-trifluoromethyl-phenyl)-propionamide(Hydroxyflutamide) CHEMBL491 Hydroxyflutamide Sch 16423 cid_91649 | hydroxy-flutamide
Type:
Small organic molecule
Emp. Form.:
C11H11F3N2O4
Mol. Mass.:
292.2112
SMILES:
CC(C)(O)C(=O)Nc1ccc(c(c1)C(F)(F)F)[N+]([O-])=O
: