Target
Serine/threonine-protein kinase Nek1
Ligand
BDBM50431030
Substrate
Meas. Tech.
ChEMBL_947331 (CHEMBL2344115)
IC50
77000±n/a nM
Citation
 Brown, AShi, QMoore, TWYoon, YPrussia, AMaddox, CLiotta, DCShim, HSnyder, JP Monocarbonyl curcumin analogues: heterocyclic pleiotropic kinase inhibitors that mediate anticancer properties. J Med Chem 56:3456-66 (2013)  
Target
Name:
Serine/threonine-protein kinase Nek1
Synonyms:
KIAA1901 NEK1 Never in mitosis A-related kinase 1 Renal carcinoma antigen NY-REN-55
Type:
Protein
Mol. Mass.:
142810.07
Organism:
Homo sapiens (Human)
Description:
Residue:
1258
  
Inhibitor
Name:
BDBM50431030
Synonyms:
CHEMBL379849
Type:
Small organic molecule
Emp. Form.:
C19H15F2NO
Mol. Mass.:
311.3253
SMILES:
Fc1ccccc1\C=C1/CNC\C(=C/c2ccccc2F)C1=O
: