Target
NAD-dependent protein deacetylase sirtuin-1
Ligand
BDBM50431117
Substrate
Meas. Tech.
ChEMBL_948318 (CHEMBL2341152)
IC50
14±n/a nM
Citation
 Disch, JSEvindar, GChiu, CHBlum, CADai, HJin, LSchuman, ELind, KEBelyanskaya, SLDeng, JCoppo, FAquilani, LGraybill, TLCuozzo, JWLavu, SMao, CVlasuk, GPPerni, RB Discovery of thieno[3,2-d]pyrimidine-6-carboxamides as potent inhibitors of SIRT1, SIRT2, and SIRT3. J Med Chem 56:3666-79 (2013)  
Target
Name:
NAD-dependent protein deacetylase sirtuin-1
Synonyms:
NAD-Dependent Deacetylase Sirtuin-1 NAD-dependent protein deacetylase sirtuin-1 (SIRT1) SIR2-like protein 1 SIRT1 Sirtuin-1 (SIRT1) | hSIR2
Type:
Developmental protein; hydrolase
Mol. Mass.:
81626.66
Organism:
Homo sapiens (Human)
Description:
Residue:
747
  
Inhibitor
Name:
BDBM50431117
Synonyms:
CHEMBL2332042
Type:
Small organic molecule
Emp. Form.:
C20H21N5O4S2
Mol. Mass.:
459.542
SMILES:
NC(=O)c1cc2ncnc(N3CCC(CCNC(=O)c4ccc(s4)C(O)=O)CC3)c2s1
: