Target
Acid ceramidase
Ligand
BDBM50431245
Substrate
Meas. Tech.
ChEMBL_949261 (CHEMBL2346137)
IC50
464±n/a nM
Citation
 Pizzirani, DPagliuca, CRealini, NBranduardi, DBottegoni, GMor, MBertozzi, FScarpelli, RPiomelli, DBandiera, T Discovery of a new class of highly potent inhibitors of acid ceramidase: synthesis and structure-activity relationship (SAR). J Med Chem 56:3518-30 (2013)  
Target
Name:
Acid ceramidase
Synonyms:
AC ASAH1_RAT Acid ceramidase Acylsphingosine deacylase N-acylsphingosine amidohydrolase
Type:
Enzyme
Mol. Mass.:
44450.22
Organism:
Rattus norvegicus (Rat)
Description:
Q6P7S1
Residue:
394
  
Inhibitor
Name:
BDBM50431245
Synonyms:
CHEMBL2333063
Type:
Small organic molecule
Emp. Form.:
C14H23N3O3
Mol. Mass.:
281.3507
SMILES:
CCCCCCCCCNC(=O)n1ccc(=O)[nH]c1=O
: