Target
Histone-lysine N-methyltransferase, H3 lysine-79 specific
Ligand
BDBM50431676
Substrate
Meas. Tech.
ChEMBL_951484 (CHEMBL2350637)
Ki
38±n/a nM
Citation
 Yu, WSmil, DLi, FTempel, WFedorov, ONguyen, KTBolshan, YAl-Awar, RKnapp, SArrowsmith, CHVedadi, MBrown, PJSchapira, M Bromo-deaza-SAH: a potent and selective DOT1L inhibitor. Bioorg Med Chem 21:1787-94 (2013)  
Target
Name:
Histone-lysine N-methyltransferase, H3 lysine-79 specific
Synonyms:
2.1.1.43 DOT1-like protein (Dot1L) DOT1L_HUMAN Histone H3-K79 methyltransferase Histone Methyltransferase DOT1L KIAA1814 Lysine N-methyltransferase 4
Type:
Protein
Mol. Mass.:
184911.91
Organism:
Homo sapiens (Human)
Description:
Q8TEK3
Residue:
1537
  
Inhibitor
Name:
BDBM50431676
Synonyms:
CHEMBL2349526
Type:
Small organic molecule
Emp. Form.:
C15H20BrN5O5S
Mol. Mass.:
462.319
SMILES:
N[C@@H](CCSC[C@H]1O[C@H]([C@H](O)[C@@H]1O)n1cc(Br)c2c(N)ncnc12)C(O)=O
: