Target
A disintegrin and metalloproteinase with thrombospondin motifs 4
Ligand
BDBM50431942
Substrate
Meas. Tech.
ChEMBL_953680 (CHEMBL2352584)
IC50
>10000±n/a nM
Citation
 Atobe, MMaekawara, NIshiguro, NSogame, SSuenaga, YKawanishi, MSuzuki, HJinno, NTanaka, EMiyoshi, S A series of thiazole derivatives bearing thiazolidin-4-one as non-competitive ADAMTS-5 (aggrecanase-2) inhibitors. Bioorg Med Chem Lett 23:2106-10 (2013)  
Target
Name:
A disintegrin and metalloproteinase with thrombospondin motifs 4
Synonyms:
A disintegrin and metalloproteinase with thrombospondin motifs 4 (ADAMTS-4) ATS4_HUMAN KIAA0688 | Metalloproteinase with thrombospondin motifs 4 (ADAMTS-4)
Type:
Enzyme
Mol. Mass.:
90214.54
Organism:
Homo sapiens (Human)
Description:
O75173
Residue:
837
  
Inhibitor
Name:
BDBM50431942
Synonyms:
CHEMBL2347847
Type:
Small organic molecule
Emp. Form.:
C15H12N2O3S2
Mol. Mass.:
332.397
SMILES:
OC(=O)Cc1sc(\C=C2/NC(=O)CS2)nc1-c1ccccc1
: