Target
A disintegrin and metalloproteinase with thrombospondin motifs 5
Ligand
BDBM50431924
Substrate
Meas. Tech.
ChEMBL_953681 (CHEMBL2352585)
IC50
2200±n/a nM
Citation
 Atobe, MMaekawara, NIshiguro, NSogame, SSuenaga, YKawanishi, MSuzuki, HJinno, NTanaka, EMiyoshi, S A series of thiazole derivatives bearing thiazolidin-4-one as non-competitive ADAMTS-5 (aggrecanase-2) inhibitors. Bioorg Med Chem Lett 23:2106-10 (2013)  
Target
Name:
A disintegrin and metalloproteinase with thrombospondin motifs 5
Synonyms:
A disintegrin and metalloproteinase with thrombospondin motifs 5 (ADAMTS-5) ADAMTS5 ATS5_HUMAN Metalloproteinase with thrombospondin motifs 5 (ADAMTS-5)
Type:
Enzyme
Mol. Mass.:
101769.09
Organism:
Homo sapiens (Human)
Description:
Q9UNA0
Residue:
930
  
Inhibitor
Name:
BDBM50431924
Synonyms:
CHEMBL2348084
Type:
Small organic molecule
Emp. Form.:
C17H17N3O2S2
Mol. Mass.:
359.466
SMILES:
CN(C)C(=O)Cc1sc(\C=C2/NC(=O)CS2)nc1-c1ccccc1
: