Target
72 kDa type IV collagenase
Ligand
BDBM50431942
Substrate
Meas. Tech.
ChEMBL_953679 (CHEMBL2352583)
IC50
>30000±n/a nM
Citation
 Atobe, MMaekawara, NIshiguro, NSogame, SSuenaga, YKawanishi, MSuzuki, HJinno, NTanaka, EMiyoshi, S A series of thiazole derivatives bearing thiazolidin-4-one as non-competitive ADAMTS-5 (aggrecanase-2) inhibitors. Bioorg Med Chem Lett 23:2106-10 (2013)  
Target
Name:
72 kDa type IV collagenase
Synonyms:
72 kDa gelatinase CLG4A Gelatinase A (MMP-2) MMP2_HUMAN Matrix metalloproteinase-2 (MMP 2) Matrix metalloproteinases 2 (MMP-2) | TBE-1
Type:
Enzyme
Mol. Mass.:
73870.36
Organism:
Homo sapiens (Human)
Description:
P08253
Residue:
660
  
Inhibitor
Name:
BDBM50431942
Synonyms:
CHEMBL2347847
Type:
Small organic molecule
Emp. Form.:
C15H12N2O3S2
Mol. Mass.:
332.397
SMILES:
OC(=O)Cc1sc(\C=C2/NC(=O)CS2)nc1-c1ccccc1
: