Target
Beta-secretase 1
Ligand
BDBM50432506
Substrate
Meas. Tech.
ChEMBL_954243 (CHEMBL2352293)
IC50
24±n/a nM
Citation
 Hunt, KWCook, AWWatts, RJClark, CTVigers, GSmith, DMetcalf, ATGunawardana, IWBurkard, MCox, AAGeck Do, MKDutcher, DThomas, AARana, SKallan, NCDeLisle, RKRizzi, JPRegal, KSammond, DGroneberg, RSiu, MPurkey, HLyssikatos, JPMarlow, ALiu, XTang, TP Spirocyclicß-site amyloid precursor protein cleaving enzyme 1 (BACE1) inhibitors: from hit to lowering of cerebrospinal fluid (CSF) amyloidß in a higher species. J Med Chem 56:3379-403 (2013)  
Target
Name:
Beta-secretase 1
Synonyms:
ASP2 Aspartyl protease 2 BACE1 Beta-secretase (BACE) Beta-secretase 1 (BACE 1) Beta-secretase 1 (BACE1) Beta-site amyloid precursor protein cleaving enzyme 1 Memapsin-2 beta-Secretase (BACE-1) | beta-Secretase (BACE1)
Type:
Protein
Mol. Mass.:
55755.10
Organism:
Homo sapiens (Human)
Description:
P56817
Residue:
501
  
Inhibitor
Name:
BDBM50432506
Synonyms:
CHEMBL2349612
Type:
Small organic molecule
Emp. Form.:
C20H20ClN3O2
Mol. Mass.:
369.845
SMILES:
CN1C(N)=NC2(CC(C)(C)Oc3ccc(cc23)-c2cccc(Cl)c2)C1=O
: