Target
Cathepsin D
Ligand
BDBM50432513
Substrate
Meas. Tech.
ChEMBL_954242 (CHEMBL2352017)
IC50
1717±n/a nM
Citation
 Hunt, KWCook, AWWatts, RJClark, CTVigers, GSmith, DMetcalf, ATGunawardana, IWBurkard, MCox, AAGeck Do, MKDutcher, DThomas, AARana, SKallan, NCDeLisle, RKRizzi, JPRegal, KSammond, DGroneberg, RSiu, MPurkey, HLyssikatos, JPMarlow, ALiu, XTang, TP Spirocyclicß-site amyloid precursor protein cleaving enzyme 1 (BACE1) inhibitors: from hit to lowering of cerebrospinal fluid (CSF) amyloidß in a higher species. J Med Chem 56:3379-403 (2013)  
Target
Name:
Cathepsin D
Synonyms:
CATD_HUMAN CTSD Cathepsin D heavy chain Cathepsin D precursor
Type:
Enzyme
Mol. Mass.:
44551.72
Organism:
Homo sapiens (Human)
Description:
Human proCathepsin D (SwissProt accession number P07339) was expressed in Sf9 cells, purified, and autoactivated.
Residue:
412
  
Inhibitor
Name:
BDBM50432513
Synonyms:
CHEMBL2349467
Type:
Small organic molecule
Emp. Form.:
C19H19ClN4O2
Mol. Mass.:
370.833
SMILES:
CN1C(N)=N[C@@]2(CC(C)(C)Oc3ccc(cc23)-c2cncc(Cl)c2)C1=O
: