Target
Cathepsin D
Ligand
BDBM50432547
Substrate
Meas. Tech.
ChEMBL_954242 (CHEMBL2352017)
IC50
447±n/a nM
Citation
 Hunt, KWCook, AWWatts, RJClark, CTVigers, GSmith, DMetcalf, ATGunawardana, IWBurkard, MCox, AAGeck Do, MKDutcher, DThomas, AARana, SKallan, NCDeLisle, RKRizzi, JPRegal, KSammond, DGroneberg, RSiu, MPurkey, HLyssikatos, JPMarlow, ALiu, XTang, TP Spirocyclicß-site amyloid precursor protein cleaving enzyme 1 (BACE1) inhibitors: from hit to lowering of cerebrospinal fluid (CSF) amyloidß in a higher species. J Med Chem 56:3379-403 (2013)  
Target
Name:
Cathepsin D
Synonyms:
CATD_HUMAN CTSD Cathepsin D heavy chain Cathepsin D precursor
Type:
Enzyme
Mol. Mass.:
44551.72
Organism:
Homo sapiens (Human)
Description:
Human proCathepsin D (SwissProt accession number P07339) was expressed in Sf9 cells, purified, and autoactivated.
Residue:
412
  
Inhibitor
Name:
BDBM50432547
Synonyms:
CHEMBL2349495
Type:
Small organic molecule
Emp. Form.:
C21H23N3O2S
Mol. Mass.:
381.491
SMILES:
CSc1cccc(c1)-c1ccc2OC(C)(C)CC3(N=C(N)N(C)C3=O)c2c1
: