Target
Histone deacetylase 6
Ligand
BDBM34168
Substrate
Meas. Tech.
ChEMBL_950483 (CHEMBL2351235)
IC50
16285±n/a nM
Citation
 Chen, JBChern, TRWei, TTChen, CCLin, JHFang, JM Design and synthesis of dual-action inhibitors targeting histone deacetylases and 3-hydroxy-3-methylglutaryl coenzyme A reductase for cancer treatment. J Med Chem 56:3645-55 (2013)  
Target
Name:
Histone deacetylase 6
Synonyms:
Cereblon/Histone deacetylase 6 HDAC6 Histone deacetylase 6 (HDAC6) KIAA0901 | ORF Names:JM21
Type:
Chromatin regulator; hydrolase; repressor
Mol. Mass.:
131381.51
Organism:
Homo sapiens (Human)
Description:
Q9UBN7
Residue:
1215
  
Inhibitor
Name:
BDBM34168
Synonyms:
LOVASTATIN SMR000058779 US9353061, Lovastatina | cid_53232
Type:
Small organic molecule
Emp. Form.:
C24H36O5
Mol. Mass.:
404.5396
SMILES:
CC[C@H](C)C(=O)O[C@H]1C[C@@H](C)C=C2C=C[C@H](C)[C@H](CC[C@@H]3C[C@@H](O)CC(=O)O3)[C@@H]12
: