Target
Myeloperoxidase
Ligand
BDBM50432576
Substrate
Meas. Tech.
ChEMBL_950697 (CHEMBL2352940)
IC50
10.0±n/a nM
Citation
 Soubhye, JAldib, IElfving, BGelbcke, MFurtmüller, PGPodrecca, MConotte, RColet, JMRousseau, AReye, FSarakbi, AVanhaeverbeek, MKauffmann, JMObinger, CNève, JPrévost, MZouaoui Boudjeltia, KDufrasne, FVan Antwerpen, P Design, synthesis, and structure-activity relationship studies of novel 3-alkylindole derivatives as selective and highly potent myeloperoxidase inhibitors. J Med Chem 56:3943-58 (2013)  
Target
Name:
Myeloperoxidase
Synonyms:
84 kDa myeloperoxidase MPO Myeloperoxidase Myeloperoxidase heavy chain PERM_HUMAN
Type:
Enzyme
Mol. Mass.:
83888.32
Organism:
Homo sapiens (Human)
Description:
P05164
Residue:
745
  
Inhibitor
Name:
BDBM50432576
Synonyms:
CHEMBL2347167
Type:
Small organic molecule
Emp. Form.:
C13H17FN2O
Mol. Mass.:
236.2853
SMILES:
OCCNCCCc1c[nH]c2ccc(F)cc12
: