Target
Beta-1 adrenergic receptor
Ligand
BDBM50027873
Substrate
Meas. Tech.
ChEMBL_952282 (CHEMBL2351861)
Kd
17±n/a nM
Citation
 Mistry, SNBaker, JGFischer, PMHill, SJGardiner, SMKellam, B Synthesis and in vitro and in vivo characterization of highlyß1-selectiveß-adrenoceptor partial agonists. J Med Chem 56:3852-65 (2013)  
Target
Name:
Beta-1 adrenergic receptor
Synonyms:
ADRB1 ADRB1_HUMAN Beta-1 adrenoceptor | adrenergic Beta1
Type:
G Protein-Coupled Receptor (GPCR)
Mol. Mass.:
51338.40
Organism:
Homo sapiens (Human)
Description:
P08588
Residue:
477
  
Inhibitor
Name:
BDBM50027873
Synonyms:
CHEMBL2348214
Type:
Small organic molecule
Emp. Form.:
C26H37N3O5
Mol. Mass.:
471.5891
SMILES:
Cc1ccc(NC(=O)NCCNCC(O)COc2ccc(OCCOC3CCCC3)cc2)cc1
: