Target
Beta-1 adrenergic receptor
Ligand
BDBM25748
Substrate
Meas. Tech.
ChEMBL_952279 (CHEMBL2351585)
Kd
0.331131±n/a nM
Citation
 Mistry, SNBaker, JGFischer, PMHill, SJGardiner, SMKellam, B Synthesis and in vitro and in vivo characterization of highlyß1-selectiveß-adrenoceptor partial agonists. J Med Chem 56:3852-65 (2013)  
Target
Name:
Beta-1 adrenergic receptor
Synonyms:
ADRB1 ADRB1_HUMAN Beta-1 adrenoceptor | adrenergic Beta1
Type:
G Protein-Coupled Receptor (GPCR)
Mol. Mass.:
51338.40
Organism:
Homo sapiens (Human)
Description:
P08588
Residue:
477
  
Inhibitor
Name:
BDBM25748
Synonyms:
3-(2-{[3-(2-cyanophenoxy)-2-hydroxypropyl]amino}ethyl)-1-phenylurea ICI 89406
Type:
Small organic molecule
Emp. Form.:
C19H22N4O3
Mol. Mass.:
354.403
SMILES:
OC(CNCCNC(=O)Nc1ccccc1)COc1ccccc1C#N
: