Target
Beta-1 adrenergic receptor
Ligand
BDBM50027888
Substrate
Meas. Tech.
ChEMBL_952282 (CHEMBL2351861)
Kd
13±n/a nM
Citation
 Mistry, SNBaker, JGFischer, PMHill, SJGardiner, SMKellam, B Synthesis and in vitro and in vivo characterization of highlyß1-selectiveß-adrenoceptor partial agonists. J Med Chem 56:3852-65 (2013)  
Target
Name:
Beta-1 adrenergic receptor
Synonyms:
ADRB1 ADRB1_HUMAN Beta-1 adrenoceptor | adrenergic Beta1
Type:
G Protein-Coupled Receptor (GPCR)
Mol. Mass.:
51338.40
Organism:
Homo sapiens (Human)
Description:
P08588
Residue:
477
  
Inhibitor
Name:
BDBM50027888
Synonyms:
CHEMBL2348210
Type:
Small organic molecule
Emp. Form.:
C25H35N3O6
Mol. Mass.:
473.5619
SMILES:
OC(CNCCNC(=O)Nc1cccc(O)c1)COc1ccc(OCCOC2CCCC2)cc1
: